BDBM50244675 2-Chloro-5-(3-dimethylamino-benzoylamino)-N-pyridin-3-yl-benzamide::CHEMBL516813
SMILES CN(C)c1cccc(c1)C(=O)Nc1ccc(Cl)c(c1)C(=O)Nc1cccnc1
InChI Key InChIKey=FWDFANUPSHXNBN-UHFFFAOYSA-N
Data  1 IC50
  Tab Delimited (TSV)   2D SDfile   Computed 3D by Vconf -m prep SDfile
Find this compound or compounds like it in BindingDB:
Activity Spreadsheet -- Enzyme Inhibition Constant Data from BindingDB
Found 1 hit for monomerid = 50244675
TargetMacrophage colony-stimulating factor 1 receptor(Homo sapiens (Human))
Astrazeneca R&D Boston
Curated by ChEMBL
LigandPNGBDBM50244675(2-Chloro-5-(3-dimethylamino-benzoylamino)-N-pyridi...)
Affinity DataIC50:  16nM. Assay description: Inhibition of CSF1R (unknown origin)
In DepthDetails ArticlePubMed