BDBM50244682 CHEMBL462197::N-(4-(methylsulfonyl)phenyl)-5-nitro-6-(4-(3-(pyridin-3-yl)-1,2,4-oxadiazol-5-yl)piperidin-1-yl)pyrimidin-4-amine
SMILES CS(=O)(=O)c1ccc(Nc2ncnc(N3CCC(CC3)c3nc([n-][o+]3)-c3cccnc3)c2[N+]([O-])=O)cc1
InChI Key InChIKey=OBUZOPJDMBTCDN-UHFFFAOYSA-N
Data  1 EC50
  Tab Delimited (TSV)   2D SDfile   Computed 3D by Vconf -m prep SDfile
Find this compound or compounds like it in BindingDB:
Activity Spreadsheet -- Enzyme Inhibition Constant Data from BindingDB
Found 1 hit for monomerid = 50244682
TargetGlucose-dependent insulinotropic receptor(Homo sapiens (Human))
Arena Pharmaceuticals
Curated by ChEMBL
LigandPNGBDBM50244682(CHEMBL462197 | N-(4-(methylsulfonyl)phenyl)-5-nitr...)
Affinity DataEC50:  660nM. Assay description: Agonist activity at CPR119 (unknown origin) transfected in Xenopus dermal melanophore assessed as dispersion of melatonin-induced pigmentation
In DepthDetails ArticlePubMed