BDBM50244726 2-chloro-5-[(3,4-dichlorobenzoyl)amino]-N-pyridin-3-ylbenzamide::CHEMBL461365
SMILES Clc1ccc(cc1Cl)C(=O)Nc1ccc(Cl)c(c1)C(=O)Nc1cccnc1
InChI Key InChIKey=FSOILYVUZFVLPB-UHFFFAOYSA-N
Data  1 IC50
  Tab Delimited (TSV)   2D SDfile   Computed 3D by Vconf -m prep SDfile
Find this compound or compounds like it in BindingDB:
Activity Spreadsheet -- Enzyme Inhibition Constant Data from BindingDB
Found 1 hit for monomerid = 50244726
TargetMacrophage colony-stimulating factor 1 receptor(Homo sapiens (Human))
Astrazeneca R&D Boston
Curated by ChEMBL
LigandPNGBDBM50244726(2-chloro-5-[(3,4-dichlorobenzoyl)amino]-N-pyridin-...)
Affinity DataIC50:  3nM. Assay description: Inhibition of CSF1R (unknown origin)
In DepthDetails ArticlePubMed