BDBM50244732 6-(4-(3-isopropyl-1,2,4-oxadiazol-5-yl)piperidin-1-yl)-5-nitro-N-(4-(propylsulfonyl)phenyl)-pyrimidin-4-amine::CHEMBL461558
SMILES CCCS(=O)(=O)c1ccc(Nc2ncnc(N3CCC(CC3)c3nc([n-][o+]3)C(C)C)c2[N+]([O-])=O)cc1
InChI Key InChIKey=FTXDUXBGXXFBLF-UHFFFAOYSA-N
Data  1 EC50
  Tab Delimited (TSV)   2D SDfile   Computed 3D by Vconf -m prep SDfile
Find this compound or compounds like it in BindingDB:
Activity Spreadsheet -- Enzyme Inhibition Constant Data from BindingDB
Found 1 hit for monomerid = 50244732
TargetGlucose-dependent insulinotropic receptor(Homo sapiens (Human))
Arena Pharmaceuticals
Curated by ChEMBL
LigandPNGBDBM50244732(6-(4-(3-isopropyl-1,2,4-oxadiazol-5-yl)piperidin-1...)
Affinity DataEC50:  4.70nM. Assay description: Agonist activity at CPR119 (unknown origin) transfected in Xenopus dermal melanophore assessed as dispersion of melatonin-induced pigmentation
In DepthDetails ArticlePubMed