BDBM50244804 CHEMBL518503::rac-(E/Z)-(4-(4-chlorobenzylidene)-2-(hydroxymethyl)-5-oxo-tetrahydrofuran-2-yl)methyl 3,5,5-trimethylhexanoate
SMILES CC(CC(=O)OCC1(CO)C\C(=C\c2ccc(Cl)cc2)C(=O)O1)CC(C)(C)C
InChI Key InChIKey=BBJGEALTXUKPHL-YVLHZVERSA-N
Data  1 KI
  Tab Delimited (TSV)   2D SDfile   Computed 3D by Vconf -m prep SDfile
Find this compound or compounds like it in BindingDB:
Activity Spreadsheet -- Enzyme Inhibition Constant Data from BindingDB
Found 1 hit for monomerid = 50244804
TargetProtein kinase C alpha type(MOUSE)
National Cancer Institute-Frederick
Curated by ChEMBL
LigandPNGBDBM50244804(CHEMBL518503 | rac-(E/Z)-(4-(4-chlorobenzylidene)-...)
Affinity DataKi:  16.8nM. Assay description: Displacement of [3H]PDBu form mouse PKCalpha by scintillation counting
In DepthDetails ArticlePubMed