BDBM50244898 2-Chloro-N-(2-cyclopropyl-thiazol-5-yl)-5-(3-trifluoromethyl-benzoylamino)-benzamide::CHEMBL472512
SMILES FC(F)(F)c1cccc(c1)C(=O)Nc1ccc(Cl)c(c1)C(=O)Nc1cnc(s1)C1CC1
InChI Key InChIKey=SDKYEKHDYRDABP-UHFFFAOYSA-N
Data  1 IC50
  Tab Delimited (TSV)   2D SDfile   Computed 3D by Vconf -m prep SDfile
Find this compound or compounds like it in BindingDB:
Activity Spreadsheet -- Enzyme Inhibition Constant Data from BindingDB
Found 1 hit for monomerid = 50244898
TargetMacrophage colony-stimulating factor 1 receptor(Homo sapiens (Human))
Astrazeneca R&D Boston
Curated by ChEMBL
LigandPNGBDBM50244898(2-Chloro-N-(2-cyclopropyl-thiazol-5-yl)-5-(3-trifl...)
Affinity DataIC50:  140nM. Assay description: Inhibition of CSF1R (unknown origin)
In DepthDetails ArticlePubMed