BDBM50245202 CHEMBL503331::N-(((R)-1-(1-(3-ethoxyphenyl)-2-p-tolyl-1H-imidazole-4-carbonyl)-4-(quinolin-3-yl)piperazin-2-yl)methyl)acetamide
SMILES CCOc1cccc(c1)-n1cc(nc1-c1ccc(C)cc1)C(=O)N1CCN(C[C@H]1CNC(C)=O)c1cnc2ccccc2c1
InChI Key InChIKey=NXULPXNFYUETPQ-SSEXGKCCSA-N
Data  1 IC50  1 EC50
  Tab Delimited (TSV)   2D SDfile   Computed 3D by Vconf -m prep SDfile
Find this compound or compounds like it in BindingDB:
Activity Spreadsheet -- Enzyme Inhibition Constant Data from BindingDB
Found 2 hits for monomerid = 50245202
TargetCholecystokinin receptor type A(Homo sapiens (Human))
Merck
Curated by ChEMBL
LigandPNGBDBM50245202(CHEMBL503331 | N-(((R)-1-(1-(3-ethoxyphenyl)-2-p-t...)
Affinity DataEC50:  0.0970nM. Assay description: Agonist activity at human CCK1 receptor
In DepthDetails ArticlePubMed
TargetCholecystokinin receptor type A(Homo sapiens (Human))
Merck
Curated by ChEMBL
LigandPNGBDBM50245202(CHEMBL503331 | N-(((R)-1-(1-(3-ethoxyphenyl)-2-p-t...)
Affinity DataIC50:  0.390nM. Assay description: Inhibition of human CCK1 receptor
In DepthDetails ArticlePubMed