BDBM50245899 (2R,3R,4R,5S,6S)-2-(azidomethyl)-6-(1,4-dimethoxynaphthalen-2-yl)tetrahydro-2H-pyran-3,4,5-triyl tribenzoate::CHEMBL450150
SMILES COc1cc([C@@H]2O[C@H](CN=[N+]=[N-])[C@@H](OC(=O)c3ccccc3)[C@H](OC(=O)c3ccccc3)[C@H]2OC(=O)c2ccccc2)c(OC)c2ccccc12
InChI Key InChIKey=KZXNZHLYAFHERG-LDZPPIGGSA-N
Data  1 IC50
  Tab Delimited (TSV)   2D SDfile   Computed 3D by Vconf -m prep SDfile
Find this compound or compounds like it in BindingDB:
Activity Spreadsheet -- Enzyme Inhibition Constant Data from BindingDB
Found 1 hit for monomerid = 50245899
TargetTyrosine-protein phosphatase non-receptor type 1(Homo sapiens (Human))
Cnrs
Curated by ChEMBL
LigandPNGBDBM50245899((2R,3R,4R,5S,6S)-2-(azidomethyl)-6-(1,4-dimethoxyn...)
Affinity DataIC50:  2.36E+3nM. Assay description: Inhibition of recombinant PTP1B
In DepthDetails ArticlePubMed