BDBM50246114 (2S,3S,4R,5R,6R)-5-acetoxy-6-(benzamidomethyl)-2-(2,5-dimethoxyphenyl)tetrahydro-2H-pyran-3,4-diyl dibenzoate::CHEMBL454521
SMILES COc1ccc(OC)c(c1)[C@@H]1O[C@H](CNC(=O)c2ccccc2)[C@@H](OC(C)=O)[C@H](OC(=O)c2ccccc2)[C@H]1OC(=O)c1ccccc1
InChI Key InChIKey=WEZWMQUFMRFDPK-BBZHULIZSA-N
Data  1 IC50
  Tab Delimited (TSV)   2D SDfile   Computed 3D by Vconf -m prep SDfile
Find this compound or compounds like it in BindingDB:
Activity Spreadsheet -- Enzyme Inhibition Constant Data from BindingDB
Found 1 hit for monomerid = 50246114
TargetTyrosine-protein phosphatase non-receptor type 1(Homo sapiens (Human))
Cnrs
Curated by ChEMBL
LigandPNGBDBM50246114((2S,3S,4R,5R,6R)-5-acetoxy-6-(benzamidomethyl)-2-(...)
Affinity DataIC50:  4.52E+3nM. Assay description: Inhibition of recombinant PTP1B
In DepthDetails ArticlePubMed