BDBM50251629 CHEMBL4068601
SMILES O=C(\C=C/Nc1ccc(cc1)S(=O)(=O)Nc1cnc2ccccc2n1)c1ccc2Sc3ccccc3Nc2c1
InChI Key InChIKey=OHKDLGVJSAGTEQ-NXVVXOECSA-N
Data  1 IC50
  Tab Delimited (TSV)   2D SDfile   Computed 3D by Vconf -m prep SDfile
Find this compound or compounds like it in BindingDB:
Activity Spreadsheet -- Enzyme Inhibition Constant Data from BindingDB
Found 1 hit for monomerid = 50251629
TargetAromatase(Homo sapiens (Human))
King Saud University
Curated by ChEMBL
LigandPNGBDBM50251629(CHEMBL4068601)
Affinity DataIC50:  8.90E+3nM. Assay description: Inhibition of aromatase activity in human T47D cells after 24 hrs
Ligand InfoPC cidPC sid
In DepthDetails ArticlePubMed