BDBM50252627 CHEMBL4100054
SMILES Cl.CCCOc1ccc(CN)cc1Cl
InChI Key InChIKey=BVPLWEHIQIGKSU-UHFFFAOYSA-N
Data  1 Kd
  Tab Delimited (TSV)   2D SDfile   Computed 3D by Vconf -m prep SDfile
Find this compound or compounds like it in BindingDB:
Activity Spreadsheet -- Enzyme Inhibition Constant Data from BindingDB
Found 1 hit for monomerid = 50252627
TargetCasein kinase II subunit alpha(Homo sapiens (Human))
University of Cambridge
Curated by ChEMBL
LigandPNGBDBM50252627(CHEMBL4100054)
Affinity DataKd:  6.29E+5nM. Assay description: Binding affinity to CK2alpha (unknown origin) by ITC
In DepthDetails ArticlePubMed