BDBM50255214 CHEMBL4088986
SMILES NC(=O)c1ccc(N[C@H]2CCCNC2)c2cc([nH]c12)-c1ccc(F)cc1
InChI Key InChIKey=WKBSJXTYLRNRCT-AWEZNQCLSA-N
Data  2 IC50  1 EC50
  Tab Delimited (TSV)   2D SDfile   Computed 3D by Vconf -m prep SDfile
Find this compound or compounds like it in BindingDB:
Activity Spreadsheet -- Enzyme Inhibition Constant Data from BindingDB
Found 3 hits for monomerid = 50255214
TargetSerine/threonine-protein kinase Chk1(Homo sapiens (Human))
Astrazeneca
Curated by ChEMBL
LigandPNGBDBM50255214(CHEMBL4088986)
Affinity DataIC50:  23nM. Assay description: Inhibition of CHK1 (unknown origin)
In DepthDetails ArticlePubMed
TargetSerine/threonine-protein kinase Chk1(Homo sapiens (Human))
Astrazeneca
Curated by ChEMBL
LigandPNGBDBM50255214(CHEMBL4088986)
Affinity DataEC50:  40nM. Assay description: Inhibition of human ERG expressed in CHO cells at -80 mV holding potential by patch clamp assay
In DepthDetails ArticlePubMed
TargetPotassium voltage-gated channel subfamily H member 2(Homo sapiens (Human))
Astrazeneca
Curated by ChEMBL
LigandPNGBDBM50255214(CHEMBL4088986)
Affinity DataIC50:  6.70E+3nM. Assay description: Inhibition of human ERG expressed in CHO cells at -80 mV holding potential by patch clamp assay
In DepthDetails ArticlePubMed