BDBM50255774 CHEMBL4101463
SMILES CC(C)C[C@H](NC(=O)[C@@H](NC(=O)CNC(=O)c1ccccc1)C(C)C)C(=O)N[C@@H](CCCCNC(=O)C[C@@](C)(Sc1cccc2ccccc12)C(O)=O)C(=O)N[C@@H](CCC(O)=O)C(=O)N[C@@H](Cc1ccc(O)cc1)C(=O)NCC(=O)N[C@@H](C(C)C)C(N)=O
InChI Key InChIKey=JUUZHUMGSOQPFS-MDHOMNBYSA-N
Data  1 IC50
  Tab Delimited (TSV)   2D SDfile   Computed 3D by Vconf -m prep SDfile
Find this compound or compounds like it in BindingDB:
Activity Spreadsheet -- Enzyme Inhibition Constant Data from BindingDB
Found 1 hit for monomerid = 50255774
TargetNAD-dependent protein deacylase sirtuin-5, mitochondrial(Homo sapiens (Human))
Martin-Luther-University Halle-Wittenberg
Curated by ChEMBL
LigandPNGBDBM50255774(CHEMBL4101463)
Affinity DataIC50:  90nM. Assay description: Inhibition of human recombinant N-terminal Strep2-tagged SIRT5 expressed in Escherichia coli BL21 (DE3) using Abz-GVLK(glutaryl)AY(NO2)GV-NH2 as subs...
In DepthDetails ArticlePubMed