BDBM50256258 CHEMBL4105186
SMILES Fc1ccccc1C1Nc2cc(Cl)ccc2C(=O)N1CCOc1ccc(cc1)-c1nc2ccccc2n1Cc1ccncc1
InChI Key InChIKey=GOLRKXKHXZGFPK-UHFFFAOYSA-N
Data  1 Kd
  Tab Delimited (TSV)   2D SDfile   Computed 3D by Vconf -m prep SDfile
Find this compound or compounds like it in BindingDB:
Activity Spreadsheet -- Enzyme Inhibition Constant Data from BindingDB
Found 1 hit for monomerid = 50256258
TargetRetinal rod rhodopsin-sensitive cGMP 3',5'-cyclic phosphodiesterase subunit delta(Homo sapiens (Human))
Second Military Medical University
Curated by ChEMBL
LigandPNGBDBM50256258(CHEMBL4105186)
Affinity DataKd:  16nM. Assay description: Inhibition of platelet-derived growth factor receptor beta phosphorylation in MG63 cells in the absence of plasma
In DepthDetails ArticlePubMed