BDBM50257573 CHEMBL492362::N-benzyl-6,9-dimethoxy-N-methyl-2,3,4,5-tetrahydro-1H-benzo[d]azepine-7-sulfonamide
SMILES COc1cc(c(OC)c2CCNCCc12)S(=O)(=O)N(C)Cc1ccccc1
InChI Key InChIKey=QQMIIWZERKKDBK-UHFFFAOYSA-N
Data  2 EC50
  Tab Delimited (TSV)   2D SDfile   Computed 3D by Vconf -m prep SDfile
Find this compound or compounds like it in BindingDB:
Activity Spreadsheet -- Enzyme Inhibition Constant Data from BindingDB
Found 2 hits for monomerid = 50257573
Target5-hydroxytryptamine receptor 2B(Homo sapiens (Human))
Pfizer
Curated by ChEMBL
LigandPNGBDBM50257573(CHEMBL492362 | N-benzyl-6,9-dimethoxy-N-methyl-2,3...)
Affinity DataEC50: >9.94E+3nM. Assay description: Agonist activity at human recombinant 5HT2B receptor by cell-based system
In DepthDetails ArticlePubMed
Target5-hydroxytryptamine receptor 2C(Homo sapiens (Human))
Pfizer
Curated by ChEMBL
LigandPNGBDBM50257573(CHEMBL492362 | N-benzyl-6,9-dimethoxy-N-methyl-2,3...)
Affinity DataEC50:  170nM. Assay description: Agonist activity at human recombinant 5HT2C receptor expressed in CHOK1 cells assessed as calcium mobilization by FLIPR assay
In DepthDetails ArticlePubMed