BDBM50259867 (-)-clusin::CHEMBL479701
SMILES COc1cc(C[C@@H]2[C@@H](Cc3ccc4OCOc4c3)COC2O)cc(OC)c1OC
InChI Key InChIKey=SOCNBZCAGNYAED-OKFXBHNASA-N
Data  1 KI  2 IC50
  Tab Delimited (TSV)   2D SDfile   Computed 3D by Vconf -m prep SDfile
Find this compound or compounds like it in BindingDB:
Activity Spreadsheet -- Enzyme Inhibition Constant Data from BindingDB
Found 3 hits for monomerid = 50259867
TargetCytochrome P450 3A4(Homo sapiens (Human))
F. Hoffmann-La Roche
Curated by ChEMBL
LigandPNGBDBM50259867((-)-clusin | CHEMBL479701)
Affinity DataKi:  82nM. Assay description: Mechanism based inhibition of human cytochrome P450 3A4 measured by (14C)formaldehyde production from (N-methyl-14C)-erythromycin
In DepthDetails ArticlePubMed
TargetCytochrome P450 2D6(Homo sapiens (Human))
Toyama Medical And Pharmaceutical University
Curated by ChEMBL
LigandPNGBDBM50259867((-)-clusin | CHEMBL479701)
Affinity DataIC50: >1.00E+5nM. Assay description: Inhibition of human liver microsome CYP2D6 in assessed as [14C]formaldehyde formation
In DepthDetails ArticlePubMed
TargetCytochrome P450 3A4(Homo sapiens (Human))
F. Hoffmann-La Roche
Curated by ChEMBL
LigandPNGBDBM50259867((-)-clusin | CHEMBL479701)
Affinity DataIC50:  830nM. Assay description: Inhibition of human liver microsome CYP3A4 in assessed as [14C]formaldehyde formation
In DepthDetails ArticlePubMed