BDBM50260108 CHEMBL4082420
SMILES C(C(C1CCCCC1)C1CCCCC1)[C@H]1CCCCN1
InChI Key InChIKey=CYXKNKQEMFBLER-GOSISDBHSA-N
Data  1 IC50
  Tab Delimited (TSV)   2D SDfile   Computed 3D by Vconf -m prep SDfile
Find this compound or compounds like it in BindingDB:
Activity Spreadsheet -- Enzyme Inhibition Constant Data from BindingDB
Found 1 hit for monomerid = 50260108
TargetCarnitine O-palmitoyltransferase 1, muscle isoform(Rattus norvegicus)
University of Aberdeen
Curated by ChEMBL
LigandPNGBDBM50260108(CHEMBL4082420)
Affinity DataIC50:  3.20E+4nM. Assay description: Inhibition of Wistar rat heart mitochondrial CPT-1 assessed as reduction in conversion of palmitoyl CoA and L-carnitine into palmitoylcarnitine prein...
In DepthDetails ArticlePubMed