BDBM50260910 4-(3-chloro-4-(5-(1-(4-chlorophenyl)cyclobutyl)-4-methyl-4H-1,2,4-triazol-3-yl)phenyl)pyridine::CHEMBL522066
SMILES Cn1c(nnc1C1(CCC1)c1ccc(Cl)cc1)-c1ccc(cc1Cl)-c1ccncc1
InChI Key InChIKey=LXGZRMOAZHRDOH-UHFFFAOYSA-N
Data  3 IC50  1 EC50
  Tab Delimited (TSV)   2D SDfile   Computed 3D by Vconf -m prep SDfile
Find this compound or compounds like it in BindingDB:
Activity Spreadsheet -- Enzyme Inhibition Constant Data from BindingDB
Found 4 hits for monomerid = 50260910
TargetNuclear receptor subfamily 1 group I member 2(Homo sapiens (Human))
Merck Research Laboratories
Curated by ChEMBL
LigandPNGBDBM50260910(4-(3-chloro-4-(5-(1-(4-chlorophenyl)cyclobutyl)-4-...)
Affinity DataEC50:  7.70E+3nM. Assay description: Agonist activity at human PXR
In DepthDetails ArticlePubMed
Target11-beta-hydroxysteroid dehydrogenase type 2(Mus musculus (mouse))
Merck Research Laboratories
Curated by ChEMBL
LigandPNGBDBM50260910(4-(3-chloro-4-(5-(1-(4-chlorophenyl)cyclobutyl)-4-...)
Affinity DataIC50: >4.00E+3nM. Assay description: Inhibition of mouse 11beta HSD2
In DepthDetails ArticlePubMed
Target11-beta-hydroxysteroid dehydrogenase 1(Mus musculus (mouse))
Merck Research Laboratories
Curated by ChEMBL
LigandPNGBDBM50260910(4-(3-chloro-4-(5-(1-(4-chlorophenyl)cyclobutyl)-4-...)
Affinity DataIC50:  2nM. Assay description: Inhibition of mouse 11beta HSD1 by SPA assay
In DepthDetails ArticlePubMed
Target11-beta-hydroxysteroid dehydrogenase 1(Homo sapiens (Human))
Merck Research Laboratories
Curated by ChEMBL
LigandPNGBDBM50260910(4-(3-chloro-4-(5-(1-(4-chlorophenyl)cyclobutyl)-4-...)
Affinity DataIC50:  1nM. Assay description: Inhibition of human 11beta HSD1 by SPA assay
In DepthDetails ArticlePubMed