BDBM50261561 CHEMBL4075710
SMILES [H][C@@]12CC[C@H](OC(=O)[C@@H]3CCCN3C(=O)c3ccc(cc3)S(N)(=O)=O)[C@@]1(C)CC[C@]1([H])c3ccc(O)cc3CC[C@@]21[H]
InChI Key InChIKey=DDUJSLXJKGYGCG-OQDYUIEKSA-N
Data  1 IC50  1 EC50
  Tab Delimited (TSV)   2D SDfile   Computed 3D by Vconf -m prep SDfile
Find this compound or compounds like it in BindingDB:
Activity Spreadsheet -- Enzyme Inhibition Constant Data from BindingDB
Found 2 hits for monomerid = 50261561
TargetEstrogen receptor(Homo sapiens (Human))
Evestra
Curated by ChEMBL
LigandPNGBDBM50261561(CHEMBL4075710)
Affinity DataEC50:  432nM. Assay description: Binding affinity to ER (unknown origin) expressed in UAS-bla GripTite 293 cells by Select screen competitive binding assay
In DepthDetails ArticlePubMed
TargetCarbonic anhydrase 2(Homo sapiens (Human))
Evestra
Curated by ChEMBL
LigandPNGBDBM50261561(CHEMBL4075710)
Affinity DataIC50:  110nM. Assay description: Inhibition of human CA2 catalytic activity pre-incubated for 15 mins followed by 4-NPA substrate addition and measured every 12 to 15 secs for 5 mins...
In DepthDetails ArticlePubMed