BDBM50261583 CHEMBL4081744
SMILES [H][C@@]12CC[C@H](OC(=O)[C@@H]3CCCN3C(=O)c3ccc(o3)S(N)(=O)=O)[C@@]1(C)CC[C@]1([H])c3ccc(O)cc3CC[C@@]21[H]
InChI Key InChIKey=CCQHGJSVFKEEKH-JMUQYBNMSA-N
Data  1 IC50
  Tab Delimited (TSV)   2D SDfile   Computed 3D by Vconf -m prep SDfile
Find this compound or compounds like it in BindingDB:
Activity Spreadsheet -- Enzyme Inhibition Constant Data from BindingDB
Found 1 hit for monomerid = 50261583
TargetCarbonic anhydrase 2(Homo sapiens (Human))
Evestra
Curated by ChEMBL
LigandPNGBDBM50261583(CHEMBL4081744)
Affinity DataIC50:  250nM. Assay description: Inhibition of human CA2 catalytic activity pre-incubated for 15 mins followed by 4-NPA substrate addition and measured every 12 to 15 secs for 5 mins...
In DepthDetails ArticlePubMed