BDBM50262336 CHEMBL468163::R/S-(2S,3S)-N-(2-methoxy-5-(1,2,2,2-tetrafluoroethyl)benzyl)-2-phenylpiperidin-3-amine
SMILES COc1ccc(cc1CN[C@H]1CCCN[C@H]1c1ccccc1)C(F)C(F)(F)F
InChI Key InChIKey=SNZRUAABGYAKBS-CTCAENTCSA-N
Data  1 IC50
  Tab Delimited (TSV)   2D SDfile   Computed 3D by Vconf -m prep SDfile
Find this compound or compounds like it in BindingDB:
Activity Spreadsheet -- Enzyme Inhibition Constant Data from BindingDB
Found 1 hit for monomerid = 50262336
TargetSubstance-P receptor(Homo sapiens (Human))
Pfizer
Curated by ChEMBL
LigandPNGBDBM50262336(CHEMBL468163 | R/S-(2S,3S)-N-(2-methoxy-5-(1,2,2,2...)
Affinity DataIC50:  0.700nM. Assay description: Displacement of [3H]spiperone from NK1 receptor in human IM9 cells
In DepthDetails ArticlePubMed