BDBM50262474 CHEMBL4082303
SMILES CC(C)Nc1nc(N[C@H]2CC[C@@H](CC2)NC(=O)C2CCCN(C)C2)c2cc(ccc2n1)-c1cccc(Cl)c1
InChI Key InChIKey=GRTAXCNDKMKEAY-XKGKZCFJSA-N
Data  1 EC50
  Tab Delimited (TSV)   2D SDfile   Computed 3D by Vconf -m prep SDfile
Find this compound or compounds like it in BindingDB:
Activity Spreadsheet -- Enzyme Inhibition Constant Data from BindingDB
Found 1 hit for monomerid = 50262474
TargetAtrial natriuretic peptide receptor 1(Homo sapiens (Human))
Asubio Pharma
Curated by ChEMBL
LigandPNGBDBM50262474(CHEMBL4082303)
Affinity DataEC50:  260nM. Assay description: Agonist activity at human NPR-A expressed in CHO cells assessed as increase in intracellular cGMP accumulation after 30 mins in presence of 1-methyl-...
In DepthDetails ArticlePubMed