BDBM50263052 2-[3-Biphenyl-2-ylmethyl-2-ethyl-8-(2-oxo-propoxy)-indolizin-1-yl]-2-oxo-acetamide::CHEMBL517821
SMILES CCc1c(Cc2ccccc2-c2ccccc2)n2cccc(OCC(C)=O)c2c1C(=O)C(N)=O
InChI Key InChIKey=SDDRDZUPYOUOOW-UHFFFAOYSA-N
Data  14 IC50
  Tab Delimited (TSV)   2D SDfile   Computed 3D by Vconf -m prep SDfile
Find this compound or compounds like it in BindingDB:
Activity Spreadsheet -- Enzyme Inhibition Constant Data from BindingDB
Found 14 hits for monomerid = 50263052
TargetPhospholipase A2(Homo sapiens (Human))
University Of Washington
Curated by ChEMBL
LigandPNGBDBM50263052(2-[3-Biphenyl-2-ylmethyl-2-ethyl-8-(2-oxo-propoxy)...)
Affinity DataIC50: >1.60E+3nM. Assay description: Inhibition of human group1B phospholipase A2 fluorimetric assay
In DepthDetails ArticlePubMed
TargetPhospholipase A2(Mus musculus)
University Of Washington
Curated by ChEMBL
LigandPNGBDBM50263052(2-[3-Biphenyl-2-ylmethyl-2-ethyl-8-(2-oxo-propoxy)...)
Affinity DataIC50:  1.20E+3nM. Assay description: Inhibition of mouse group1B phospholipase A2 fluorimetric assay
In DepthDetails ArticlePubMed
TargetPhospholipase A2, membrane associated(Homo sapiens (Human))
University Of Washington
Curated by ChEMBL
LigandPNGBDBM50263052(2-[3-Biphenyl-2-ylmethyl-2-ethyl-8-(2-oxo-propoxy)...)
Affinity DataIC50:  30nM. Assay description: Inhibition of human group2A phospholipase A2 fluorimetric assay
In DepthDetails ArticlePubMed
TargetPhospholipase A2, membrane associated(Mus musculus)
University Of Washington
Curated by ChEMBL
LigandPNGBDBM50263052(2-[3-Biphenyl-2-ylmethyl-2-ethyl-8-(2-oxo-propoxy)...)
Affinity DataIC50: >1.60E+3nM. Assay description: Inhibition of mouse group2A phospholipase A2 fluorimetric assay
In DepthDetails ArticlePubMed
TargetGroup IID secretory phospholipase A2(Homo sapiens (Human))
University Of Washington
Curated by ChEMBL
LigandPNGBDBM50263052(2-[3-Biphenyl-2-ylmethyl-2-ethyl-8-(2-oxo-propoxy)...)
Affinity DataIC50: >1.30E+3nM. Assay description: Inhibition of human group2D phospholipase A2 by [3H]oleic acid-labeled Escherichia coli membrane assay
In DepthDetails ArticlePubMed
TargetGroup IID secretory phospholipase A2(Mus musculus)
University Of Washington
Curated by ChEMBL
LigandPNGBDBM50263052(2-[3-Biphenyl-2-ylmethyl-2-ethyl-8-(2-oxo-propoxy)...)
Affinity DataIC50: >1.60E+3nM. Assay description: Inhibition of mouse group2D phospholipase A2 fluorimetric assay
In DepthDetails ArticlePubMed
TargetGroup 10 secretory phospholipase A2(Mus musculus)
University Of Washington
Curated by ChEMBL
LigandPNGBDBM50263052(2-[3-Biphenyl-2-ylmethyl-2-ethyl-8-(2-oxo-propoxy)...)
Affinity DataIC50: >1.60E+3nM. Assay description: Inhibition of mouse group2X phospholipase A2 fluorimetric assay
In DepthDetails ArticlePubMed
TargetGroup IIE secretory phospholipase A2(Mus musculus)
University Of Washington
Curated by ChEMBL
LigandPNGBDBM50263052(2-[3-Biphenyl-2-ylmethyl-2-ethyl-8-(2-oxo-propoxy)...)
Affinity DataIC50:  410nM. Assay description: Inhibition of mouse group2E phospholipase A2 fluorimetric assay
In DepthDetails ArticlePubMed
TargetGroup IIF secretory phospholipase A2(Homo sapiens (Human))
University Of Washington
Curated by ChEMBL
LigandPNGBDBM50263052(2-[3-Biphenyl-2-ylmethyl-2-ethyl-8-(2-oxo-propoxy)...)
Affinity DataIC50: >1.60E+3nM. Assay description: Inhibition of human group2F phospholipase A2 fluorimetric assay
In DepthDetails ArticlePubMed
TargetGroup IIF secretory phospholipase A2(Mus musculus)
University Of Washington
Curated by ChEMBL
LigandPNGBDBM50263052(2-[3-Biphenyl-2-ylmethyl-2-ethyl-8-(2-oxo-propoxy)...)
Affinity DataIC50: >1.60E+3nM. Assay description: Inhibition of mouse group2F phospholipase A2 fluorimetric assay
In DepthDetails ArticlePubMed
TargetPhospholipase A2 group V(Homo sapiens (Human))
University Of Washington
Curated by ChEMBL
LigandPNGBDBM50263052(2-[3-Biphenyl-2-ylmethyl-2-ethyl-8-(2-oxo-propoxy)...)
Affinity DataIC50: >1.60E+3nM. Assay description: Inhibition of human group2V phospholipase A2 fluorimetric assay
In DepthDetails ArticlePubMed
TargetPhospholipase A2 group V(Mus musculus)
University Of Washington
Curated by ChEMBL
LigandPNGBDBM50263052(2-[3-Biphenyl-2-ylmethyl-2-ethyl-8-(2-oxo-propoxy)...)
Affinity DataIC50: >1.60E+3nM. Assay description: Inhibition of mouse group2V phospholipase A2 fluorimetric assay
In DepthDetails ArticlePubMed
TargetGroup 10 secretory phospholipase A2(Homo sapiens (Human))
University Of Washington
Curated by ChEMBL
LigandPNGBDBM50263052(2-[3-Biphenyl-2-ylmethyl-2-ethyl-8-(2-oxo-propoxy)...)
Affinity DataIC50: >1.60E+3nM. Assay description: Inhibition of human group2X phospholipase A2 fluorimetric assay
In DepthDetails ArticlePubMed
TargetGroup IIE secretory phospholipase A2(Homo sapiens (Human))
University Of Washington
Curated by ChEMBL
LigandPNGBDBM50263052(2-[3-Biphenyl-2-ylmethyl-2-ethyl-8-(2-oxo-propoxy)...)
Affinity DataIC50:  90nM. Assay description: Inhibition of human group2E phospholipase A2 fluorimetric assay
In DepthDetails ArticlePubMed