BDBM50264713 1-Benzyl-1H-benzoimidazole-2-carboxylic acid [3-(2-methyl-2,8-diaza-spiro[4.5]dec-8-yl)-3-oxo-propyl]-amide::CHEMBL485080
SMILES CN1CCC2(C1)CCN(CC2)C(=O)CCNC(=O)c1nc2ccccc2n1Cc1ccccc1
InChI Key InChIKey=NEBCXDAIFKXQPK-UHFFFAOYSA-N
Data  1 IC50
  Tab Delimited (TSV)   2D SDfile   Computed 3D by Vconf -m prep SDfile
Find this compound or compounds like it in BindingDB:
Activity Spreadsheet -- Enzyme Inhibition Constant Data from BindingDB
Found 1 hit for monomerid = 50264713
TargetB1 bradykinin receptor(Macaca fascicularis)
Neurogen
Curated by ChEMBL
LigandPNGBDBM50264713(1-Benzyl-1H-benzoimidazole-2-carboxylic acid [3-(2...)
Affinity DataIC50:  2.91E+3nM. Assay description: Antagonist activity at Cynomolgus monkey bradykinin B1 receptor expressed in CHO cells assessed as calcium transient by FLIPR assay
In DepthDetails ArticlePubMed