BDBM50264896 1-(4-(3-(3,5-dimethylpiperidin-1-yl)propoxy)phenyl)-5-fluoro-2-(pyridin-2-yl)-1H-benzo[d]imidazole::CHEMBL495903
SMILES CC1CC(C)CN(CCCOc2ccc(cc2)-n2c(nc3cc(F)ccc23)-c2ccccn2)C1
InChI Key InChIKey=INZNENROAMTTFF-UHFFFAOYSA-N
Data  1 KI
  Tab Delimited (TSV)   2D SDfile   Computed 3D by Vconf -m prep SDfile
Find this compound or compounds like it in BindingDB:
Activity Spreadsheet -- Enzyme Inhibition Constant Data from BindingDB
Found 1 hit for monomerid = 50264896
TargetHistamine H3 receptor(Homo sapiens (Human))
The Schering Plough Research Institute
Curated by ChEMBL
LigandPNGBDBM50264896(1-(4-(3-(3,5-dimethylpiperidin-1-yl)propoxy)phenyl...)
Affinity DataKi:  11nM. Assay description: Displacement of [3H]N-alpha-methylhistamine from human histamine H3 receptor expressed in HEK cells by scintillation counting
In DepthDetails ArticlePubMed