BDBM50264933 5-fluoro-1-(4-(3-(4-methylpiperazin-1-yl)propoxy)phenyl)-2-(pyridin-2-yl)-1H-benzo[d]imidazole::CHEMBL497355
SMILES CN1CCN(CCCOc2ccc(cc2)-n2c(nc3cc(F)ccc23)-c2ccccn2)CC1
InChI Key InChIKey=ZJSYQEJWUQGGRQ-UHFFFAOYSA-N
Data  1 KI
  Tab Delimited (TSV)   2D SDfile   Computed 3D by Vconf -m prep SDfile
Find this compound or compounds like it in BindingDB:
Activity Spreadsheet -- Enzyme Inhibition Constant Data from BindingDB
Found 1 hit for monomerid = 50264933
TargetHistamine H3 receptor(Homo sapiens (Human))
The Schering Plough Research Institute
Curated by ChEMBL
LigandPNGBDBM50264933(5-fluoro-1-(4-(3-(4-methylpiperazin-1-yl)propoxy)p...)
Affinity DataKi:  13nM. Assay description: Displacement of [3H]N-alpha-methylhistamine from human histamine H3 receptor expressed in HEK cells by scintillation counting
In DepthDetails ArticlePubMed