BDBM50264976 1-(4-(3-(azepan-1-yl)propoxy)phenyl)-5-fluoro-2-(pyridin-2-yl)-1H-benzo[d]imidazole::CHEMBL496524
SMILES Fc1ccc2n(c(nc2c1)-c1ccccn1)-c1ccc(OCCCN2CCCCCC2)cc1
InChI Key InChIKey=QIVRFKXGHZMHEN-UHFFFAOYSA-N
Data  1 KI
  Tab Delimited (TSV)   2D SDfile   Computed 3D by Vconf -m prep SDfile
Find this compound or compounds like it in BindingDB:
Activity Spreadsheet -- Enzyme Inhibition Constant Data from BindingDB
Found 1 hit for monomerid = 50264976
TargetHistamine H3 receptor(Homo sapiens (Human))
The Schering Plough Research Institute
Curated by ChEMBL
LigandPNGBDBM50264976(1-(4-(3-(azepan-1-yl)propoxy)phenyl)-5-fluoro-2-(p...)
Affinity DataKi:  5.30nM. Assay description: Displacement of [3H]N-alpha-methylhistamine from human histamine H3 receptor expressed in HEK cells by scintillation counting
In DepthDetails ArticlePubMed