BDBM50265014 1-(3-(4-(5-fluoro-2-(pyridin-2-yl)-1H-benzo[d]imidazol-1-yl)phenoxy)propyl)piperidin-4-ol::CHEMBL526450
SMILES OC1CCN(CCCOc2ccc(cc2)-n2c(nc3cc(F)ccc23)-c2ccccn2)CC1
InChI Key InChIKey=LNKQLDXMYFJALH-UHFFFAOYSA-N
Data  2 KI
  Tab Delimited (TSV)   2D SDfile   Computed 3D by Vconf -m prep SDfile
Find this compound or compounds like it in BindingDB:
Activity Spreadsheet -- Enzyme Inhibition Constant Data from BindingDB
Found 2 hits for monomerid = 50265014
TargetHistamine H3 receptor(Homo sapiens (Human))
The Schering Plough Research Institute
Curated by ChEMBL
LigandPNGBDBM50265014(1-(3-(4-(5-fluoro-2-(pyridin-2-yl)-1H-benzo[d]imid...)
Affinity DataKi:  1.80nM. Assay description: Displacement of [3H]N-alpha-methylhistamine from human histamine H3 receptor expressed in HEK cells by scintillation counting
In DepthDetails ArticlePubMed
TargetPotassium voltage-gated channel subfamily H member 2(Homo sapiens (Human))
The Schering Plough Research Institute
Curated by ChEMBL
LigandPNGBDBM50265014(1-(3-(4-(5-fluoro-2-(pyridin-2-yl)-1H-benzo[d]imid...)
Affinity DataKi:  16nM. Assay description: Binding affinity to human ERG assessed as rubidium efflux at 5 ug/mL pre-equilibrated for 30 mins by DiBAC4(3)-based flame atomic absorbance spectros...
In DepthDetails ArticlePubMed