BDBM50265665 CHEMBL4083186
SMILES CCS(=O)(=O)Nc1ccc(Oc2ccc(F)cc2F)c(c1)-c1cn(C)c(=O)cc1OC1COC1
InChI Key InChIKey=HBECBPPEGSCURU-UHFFFAOYSA-N
Data  1 KI  1 EC50
  Tab Delimited (TSV)   2D SDfile   Computed 3D by Vconf -m prep SDfile
Find this compound or compounds like it in BindingDB:
Activity Spreadsheet -- Enzyme Inhibition Constant Data from BindingDB
Found 1 hit for monomerid = 50265665
TargetBromodomain-containing protein 4(Homo sapiens (Human))
Abbvie
Curated by ChEMBL
LigandPNGBDBM50265665(CHEMBL4083186)
Affinity DataEC50:  48nM. Assay description: Inhibition of BRD4 in human NCI-H1299 cells after 24 hrs by Bright-Glo luciferase reporter gene assay
In DepthDetails ArticlePubMed