BDBM50266238 (S)-2-(naphthalen-2-yl)-N-(2-oxotetrahydrofuran-3-yl)acetamide::CHEMBL502197
SMILES O=C(Cc1ccc2ccccc2c1)N[C@H]1CCOC1=O
InChI Key InChIKey=PWOPRVCZRVIMPT-AWEZNQCLSA-N
Data  2 IC50
  Tab Delimited (TSV)   2D SDfile   Computed 3D by Vconf -m prep SDfile
Find this compound or compounds like it in BindingDB:
Activity Spreadsheet -- Enzyme Inhibition Constant Data from BindingDB
Found 2 hits for monomerid = 50266238
TargetTranscriptional activator protein LuxR(Vibrio fischeri (strain ATCC 700601 / ES114))
University Of Wisconsin-Madison
Curated by ChEMBL
LigandPNGBDBM50266238((S)-2-(naphthalen-2-yl)-N-(2-oxotetrahydrofuran-3-...)
Affinity DataIC50:  940nM. Assay description: Antagonist activity at Vibrio fischeri ES114 LuxR receptor assessed as inhibition of OHHL-induced response by luciferase reporter gene assay
In DepthDetails ArticlePubMed
TargetTranscriptional activator protein TraR(Rhizobium radiobacter)
University Of Wisconsin-Madison
Curated by ChEMBL
LigandPNGBDBM50266238((S)-2-(naphthalen-2-yl)-N-(2-oxotetrahydrofuran-3-...)
Affinity DataIC50:  4.20E+3nM. Assay description: Antagonist activity at Agrobacterium tumefaciens WCF47 TraR receptor assessed as inhibition of OOHL-induced response by beta-galctosidase reporter ge...
In DepthDetails ArticlePubMed