BDBM50266988 CHEMBL4105401
SMILES CCCCC1NC(=O)[C@@H]2CSSC[C@H](NC(=O)[C@@H](NC(=O)[C@@H]3CCCN3C(=O)[C@@H]3CCCN3C(=O)[C@@H](NC(=O)C(CCCC)NC(=O)[C@H](Cc3ccccc3)NC1=O)[C@@H](C)CC)[C@@H](C)CC)C(=O)N[C@@H](Cc1ccccc1)C(=O)N1CCC[C@H]1C(=O)N[C@@H](CC(N)=O)C(=O)NCC(=O)N[C@@H]([C@@H](C)O)C(=O)N2
InChI Key InChIKey=CUDWKKLNVSEWMS-XQACUYJXSA-N
Data  1 KI
  Tab Delimited (TSV)   2D SDfile   Computed 3D by Vconf -m prep SDfile
Find this compound or compounds like it in BindingDB:
Activity Spreadsheet -- Enzyme Inhibition Constant Data from BindingDB
Found 1 hit for monomerid = 50266988
TargetCathepsin G(Homo sapiens (Human))
The University Of Queensland
Curated by ChEMBL
LigandPNGBDBM50266988(CHEMBL4105401)
Affinity DataKi:  12nM. Assay description: Inhibition of human cathepsin G using Suc-AAPF-MCA as substrate after 30 mins
In DepthDetails ArticlePubMed