BDBM50267895 CHEMBL4084562
SMILES CCOc1ccc2nc3cc(NC(=O)c4ccc5ccccc5c4)ccc3c(N)c2c1
InChI Key InChIKey=IROLYWGWWNRZPI-UHFFFAOYSA-N
Data  1 IC50
  Tab Delimited (TSV)   2D SDfile   Computed 3D by Vconf -m prep SDfile
Find this compound or compounds like it in BindingDB:
Activity Spreadsheet -- Enzyme Inhibition Constant Data from BindingDB
Found 1 hit for monomerid = 50267895
TargetSTE20/SPS1-related proline-alanine-rich protein kinase(Rattus norvegicus)
Tokyo Medical And Dental University (Tmdu)
Curated by ChEMBL
LigandPNGBDBM50267895(CHEMBL4084562)
Affinity DataIC50:  7.60E+3nM. Assay description: Inhibition of TAMRA-labelled WNK4 binding to recombinant rat C-terminal GST-fused SPAK (452 to 553 residues) expressed in Escherichia coli BL21 measu...
In DepthDetails ArticlePubMed