BDBM50267917 CHEMBL4080499
SMILES CCOc1ccc2nc3cc(NCc4ccc(OC)cc4OC)ccc3c(N)c2c1
InChI Key InChIKey=PVEJANUPMQODSU-UHFFFAOYSA-N
Data  1 IC50
  Tab Delimited (TSV)   2D SDfile   Computed 3D by Vconf -m prep SDfile
Find this compound or compounds like it in BindingDB:
Activity Spreadsheet -- Enzyme Inhibition Constant Data from BindingDB
Found 1 hit for monomerid = 50267917
TargetSTE20/SPS1-related proline-alanine-rich protein kinase(Rattus norvegicus)
Tokyo Medical And Dental University (Tmdu)
Curated by ChEMBL
LigandPNGBDBM50267917(CHEMBL4080499)
Affinity DataIC50:  2.11E+4nM. Assay description: Inhibition of TAMRA-labelled WNK4 binding to recombinant rat C-terminal GST-fused SPAK (452 to 553 residues) expressed in Escherichia coli BL21 measu...
In DepthDetails ArticlePubMed