BDBM50268082 4,6-dimethyl-N1,N3-diphenylbenzene-1,3-disulfonamide::CHEMBL488335
SMILES Cc1cc(C)c(NS(=O)(=O)c2ccccc2)cc1NS(=O)(=O)c1ccccc1
InChI Key InChIKey=DWARPPUDJXEVIK-UHFFFAOYSA-N
Data  1 KI
  Tab Delimited (TSV)   2D SDfile   Computed 3D by Vconf -m prep SDfile
Find this compound or compounds like it in BindingDB:
Activity Spreadsheet -- Enzyme Inhibition Constant Data from BindingDB
Found 1 hit for monomerid = 50268082
TargetLiver carboxylesterase 1(Homo sapiens (Human))
St. Jude Children'S Research Hospital
Curated by ChEMBL
LigandPNGBDBM50268082(4,6-dimethyl-N1,N3-diphenylbenzene-1,3-disulfonami...)
Affinity DataKi: >1.00E+5nM. Assay description: Inhibition of human liver CE1-mediated O-nitrophenyl acetate hydrolysis by spectrophotometry
In DepthDetails ArticlePubMed