BDBM50268377 (S)-2-amino-N-((S)-1-((S)-1-amino-3-(3-tert-butyl-4-hydroxyphenyl)-1-oxopropan-2-ylamino)-1-oxo-3-phenylpropan-2-yl)-3-phenylpropanamide::CHEMBL502792
SMILES CC(C)(C)c1cc(C[C@H](NC(=O)[C@H](Cc2ccccc2)NC(=O)[C@@H](N)Cc2ccccc2)C(N)=O)ccc1O
InChI Key InChIKey=HVFIMFTUSXGDEO-GSDHBNRESA-N
Data  1 IC50
  Tab Delimited (TSV)   2D SDfile   Computed 3D by Vconf -m prep SDfile
Find this compound or compounds like it in BindingDB:
Activity Spreadsheet -- Enzyme Inhibition Constant Data from BindingDB
Found 1 hit for monomerid = 50268377
TargetMotilin receptor(Oryctolagus cuniculus)
Chugai Pharmaceutical
Curated by ChEMBL
LigandPNGBDBM50268377((S)-2-amino-N-((S)-1-((S)-1-amino-3-(3-tert-butyl-...)
Affinity DataIC50:  6nM. Assay description: Displacement of [125I]motilin from MTL receptor in rabbit duodenum homogenate
In DepthDetails ArticlePubMed