BDBM50269027 CHEMBL4096115
SMILES OCCN(c1ccccc1)S(=O)(=O)c1ccc(NC(=S)NC(=O)c2ccc3cccnc3c2)cc1
InChI Key InChIKey=LBFSZNSJAYYBKZ-UHFFFAOYSA-N
Data  1 EC50
  Tab Delimited (TSV)   2D SDfile   Computed 3D by Vconf -m prep SDfile
Find this compound or compounds like it in BindingDB:
Activity Spreadsheet -- Enzyme Inhibition Constant Data from BindingDB
Found 1 hit for monomerid = 50269027
TargetG-protein coupled receptor 55(Homo sapiens (Human))
University Of North Carolina At Greensboro
Curated by ChEMBL
LigandPNGBDBM50269027(CHEMBL4096115)
Affinity DataEC50:  200nM. Assay description: Agonist activity at beta-galactosidase enzyme fragment-fused GPR55 (unknown origin) expressed in CHOK1 cells assessed as increase in N-terminal delet...
In DepthDetails ArticlePubMed