BDBM50269145 10-hydroxy-18-N-2-naphthyl-N-phenylaminobetaenone::CHEMBL443169
SMILES CCC(C)[C@H]1[C@](C)(O)C(=O)[C@@]2(O)C[C@](C)(O)C[C@@H](C)[C@@H]2[C@]1(C)C(=O)\C=C\N(c1ccccc1)c1ccc2ccccc2c1
InChI Key InChIKey=PBODNUVAXAPXJH-YTOGWHTISA-N
Data  3 IC50
  Tab Delimited (TSV)   2D SDfile   Computed 3D by Vconf -m prep SDfile
Find this compound or compounds like it in BindingDB:
Activity Spreadsheet -- Enzyme Inhibition Constant Data from BindingDB
Found 3 hits for monomerid = 50269145
TargetProtein kinase C epsilon type(Mus musculus)
Heinrich-Heine-UniversitäT
Curated by ChEMBL
LigandPNGBDBM50269145(10-hydroxy-18-N-2-naphthyl-N-phenylaminobetaenone ...)
Affinity DataIC50: >1.00E+5nM. Assay description: Inhibition of mouse recombinant PKCepsilon expressed in Sf9 insect cells
In DepthDetails ArticlePubMed
TargetEpidermal growth factor receptor(Homo sapiens (Human))
Heinrich-Heine-UniversitäT
Curated by ChEMBL
LigandPNGBDBM50269145(10-hydroxy-18-N-2-naphthyl-N-phenylaminobetaenone ...)
Affinity DataIC50: >1.00E+5nM. Assay description: Inhibition of human recombinant EGFR kinase expressed in Sf9 insect cells
In DepthDetails ArticlePubMed
TargetCyclin-dependent kinase 4(Homo sapiens (Human))
Heinrich-Heine-UniversitäT
Curated by ChEMBL
LigandPNGBDBM50269145(10-hydroxy-18-N-2-naphthyl-N-phenylaminobetaenone ...)
Affinity DataIC50: >1.00E+5nM. Assay description: Inhibition of human recombinant CDK4/cyclin D1 kinase expressed in Sf9 insect cells
In DepthDetails ArticlePubMed