BDBM50270448 (2S,3S,4S,5R)-5-((cycloheptylamino)methyl)-3,4-dihydroxy-N-(3-nitrophenyl)-tetrahydrofuran-2-carboxamide::CHEMBL479209
SMILES O[C@H]1[C@H](O)[C@H](O[C@@H]1CNC1CCCCCC1)C(=O)Nc1cccc(c1)[N+]([O-])=O
InChI Key InChIKey=ILBLKZHRKKHEBC-BDXSIMOUSA-N
Data  1 IC50
  Tab Delimited (TSV)   2D SDfile   Computed 3D by Vconf -m prep SDfile
Find this compound or compounds like it in BindingDB:
Activity Spreadsheet -- Enzyme Inhibition Constant Data from BindingDB
Found 1 hit for monomerid = 50270448
TargetPyruvate kinase(Leishmania mexicana)
University Of Edinburgh
Curated by ChEMBL
LigandPNGBDBM50270448((2S,3S,4S,5R)-5-((cycloheptylamino)methyl)-3,4-dih...)
Affinity DataIC50:  5.30E+4nM. Assay description: Inhibition of Leishmania mexicana pyruvate kinase
In DepthDetails ArticlePubMed