BDBM50270573 7-(3-Chloro-5-fluorophenyl)-5,5-dimethyl-1,5-dihydro-4,1-benzoxazepin-2(H)-one::CHEMBL487727
SMILES CC1(C)OCC(=O)Nc2ccc(cc12)-c1cc(F)cc(Cl)c1
InChI Key InChIKey=DRHWQMAETRTTLC-UHFFFAOYSA-N
Data  1 IC50
  Tab Delimited (TSV)   2D SDfile   Computed 3D by Vconf -m prep SDfile
Find this compound or compounds like it in BindingDB:
Activity Spreadsheet -- Enzyme Inhibition Constant Data from BindingDB
Found 1 hit for monomerid = 50270573
TargetProgesterone receptor(Homo sapiens (Human))
Wyeth Research
Curated by ChEMBL
LigandPNGBDBM50270573(7-(3-Chloro-5-fluorophenyl)-5,5-dimethyl-1,5-dihyd...)
Affinity DataIC50:  15nM. Assay description: Inhibition of progesterone receptor mediated progesterone-induced alkaline phosphatase activity in human T47D cells
In DepthDetails ArticlePubMed