BDBM50270580 3-Fluoro-5-(2-oxo-5,5-dithien-2-yl-1,2,3,5-tetrahydro-4,1-benzoxazepin-7-yl)benzonitrile::CHEMBL486498
SMILES Fc1cc(cc(c1)-c1ccc2NC(=O)COC(c3cccs3)(c3cccs3)c2c1)C#N
InChI Key InChIKey=HTRKFNDRDKEPJZ-UHFFFAOYSA-N
Data  1 IC50
  Tab Delimited (TSV)   2D SDfile   Computed 3D by Vconf -m prep SDfile
Find this compound or compounds like it in BindingDB:
Activity Spreadsheet -- Enzyme Inhibition Constant Data from BindingDB
Found 1 hit for monomerid = 50270580
TargetProgesterone receptor(Homo sapiens (Human))
Wyeth Research
Curated by ChEMBL
LigandPNGBDBM50270580(3-Fluoro-5-(2-oxo-5,5-dithien-2-yl-1,2,3,5-tetrahy...)
Affinity DataIC50:  26.6nM. Assay description: Inhibition of progesterone receptor mediated progesterone-induced alkaline phosphatase activity in human T47D cells
In DepthDetails ArticlePubMed