BDBM50270598 7-(2-Fluorophenyl)-5,5-dimethyl-1,5-dihydro-4,1-benzoxazepin-2(H)-one::CHEMBL486499
SMILES CC1(C)OCC(=O)Nc2ccc(cc12)-c1ccccc1F
InChI Key InChIKey=QRUXQXQDDVAIPM-UHFFFAOYSA-N
Data  1 IC50
  Tab Delimited (TSV)   2D SDfile   Computed 3D by Vconf -m prep SDfile
Find this compound or compounds like it in BindingDB:
Activity Spreadsheet -- Enzyme Inhibition Constant Data from BindingDB
Found 1 hit for monomerid = 50270598
TargetProgesterone receptor(Homo sapiens (Human))
Wyeth Research
Curated by ChEMBL
LigandPNGBDBM50270598(7-(2-Fluorophenyl)-5,5-dimethyl-1,5-dihydro-4,1-be...)
Affinity DataIC50:  62.1nM. Assay description: Inhibition of progesterone receptor mediated progesterone-induced alkaline phosphatase activity in human T47D cells
In DepthDetails ArticlePubMed