BDBM50270600 7-(3-Chloro-4-fluorophenyl)-5-propyl-5-thien-2-yl-1,5-dihydro-4,1-benzoxazepin-2(H)-one::CHEMBL486707
SMILES CCCC1(OCC(=O)Nc2ccc(cc12)-c1ccc(F)c(Cl)c1)c1cccs1
InChI Key InChIKey=QBINHQGBESEKBY-UHFFFAOYSA-N
Data  1 IC50
  Tab Delimited (TSV)   2D SDfile   Computed 3D by Vconf -m prep SDfile
Find this compound or compounds like it in BindingDB:
Activity Spreadsheet -- Enzyme Inhibition Constant Data from BindingDB
Found 1 hit for monomerid = 50270600
TargetProgesterone receptor(Homo sapiens (Human))
Wyeth Research
Curated by ChEMBL
LigandPNGBDBM50270600(7-(3-Chloro-4-fluorophenyl)-5-propyl-5-thien-2-yl-...)
Affinity DataIC50:  349nM. Assay description: Inhibition of progesterone receptor mediated progesterone-induced alkaline phosphatase activity in human T47D cells
In DepthDetails ArticlePubMed