BDBM50270603 7-(3-Chloro-4-fluorophenyl)-5-ethyl-5-thien-3-yl-1,5-dihydro-4,1-benzoxazepin-2(3H)-one::CHEMBL488556
SMILES CCC1(OCC(=O)Nc2ccc(cc12)-c1ccc(F)c(Cl)c1)c1ccsc1
InChI Key InChIKey=BIADWZCQGLJVOB-UHFFFAOYSA-N
Data  1 IC50
  Tab Delimited (TSV)   2D SDfile   Computed 3D by Vconf -m prep SDfile
Find this compound or compounds like it in BindingDB:
Activity Spreadsheet -- Enzyme Inhibition Constant Data from BindingDB
Found 1 hit for monomerid = 50270603
TargetProgesterone receptor(Homo sapiens (Human))
Wyeth Research
Curated by ChEMBL
LigandPNGBDBM50270603(7-(3-Chloro-4-fluorophenyl)-5-ethyl-5-thien-3-yl-1...)
Affinity DataIC50:  117nM. Assay description: Inhibition of progesterone receptor mediated progesterone-induced alkaline phosphatase activity in human T47D cells
In DepthDetails ArticlePubMed