BDBM50270607 4-(5-Ethyl-2-oxo-5-thien-2-yl-1,2,3,5-tetrahydro-4,1-benzoxazepin-7-yl)thiophene-2-carbonitrile::CHEMBL486916
SMILES CCC1(OCC(=O)Nc2ccc(cc12)-c1csc(c1)C#N)c1cccs1
InChI Key InChIKey=SMNXTWWTMYQOAE-UHFFFAOYSA-N
Data  1 IC50
  Tab Delimited (TSV)   2D SDfile   Computed 3D by Vconf -m prep SDfile
Find this compound or compounds like it in BindingDB:
Activity Spreadsheet -- Enzyme Inhibition Constant Data from BindingDB
Found 1 hit for monomerid = 50270607
TargetProgesterone receptor(Homo sapiens (Human))
Wyeth Research
Curated by ChEMBL
LigandPNGBDBM50270607(4-(5-Ethyl-2-oxo-5-thien-2-yl-1,2,3,5-tetrahydro-4...)
Affinity DataIC50:  108nM. Assay description: Inhibition of progesterone receptor mediated progesterone-induced alkaline phosphatase activity in human T47D cells
In DepthDetails ArticlePubMed