BDBM50270623 7-(4-Fluorophenyl)-5,5-dimethyl-1,5-dihydro-4,1-benzoxazepin-2(H)-one::CHEMBL486910
SMILES CC1(C)OCC(=O)Nc2ccc(cc12)-c1ccc(F)cc1
InChI Key InChIKey=YNXVUMWULRNODW-UHFFFAOYSA-N
Data  1 IC50
  Tab Delimited (TSV)   2D SDfile   Computed 3D by Vconf -m prep SDfile
Find this compound or compounds like it in BindingDB:
Activity Spreadsheet -- Enzyme Inhibition Constant Data from BindingDB
Found 1 hit for monomerid = 50270623
TargetProgesterone receptor(Homo sapiens (Human))
Wyeth Research
Curated by ChEMBL
LigandPNGBDBM50270623(7-(4-Fluorophenyl)-5,5-dimethyl-1,5-dihydro-4,1-be...)
Affinity DataIC50:  100nM. Assay description: Inhibition of progesterone receptor mediated progesterone-induced alkaline phosphatase activity in human T47D cells
In DepthDetails ArticlePubMed