BDBM50270625 7-(3,4-Difluorophenyl)-5-ethyl-5-(2-furyl)-1,5-dihydro-4,1-benzoxazepin-2(H)-one::CHEMBL530108
SMILES CC1(C)OCC(=O)Nc2ccc(cc12)-c1ccc(F)c(F)c1
InChI Key InChIKey=CNILOORZJMPYQB-UHFFFAOYSA-N
Data  1 IC50
  Tab Delimited (TSV)   2D SDfile   Computed 3D by Vconf -m prep SDfile
Find this compound or compounds like it in BindingDB:
Activity Spreadsheet -- Enzyme Inhibition Constant Data from BindingDB
Found 1 hit for monomerid = 50270625
TargetProgesterone receptor(Homo sapiens (Human))
Wyeth Research
Curated by ChEMBL
LigandPNGBDBM50270625(7-(3,4-Difluorophenyl)-5-ethyl-5-(2-furyl)-1,5-dih...)
Affinity DataIC50:  29.3nM. Assay description: Inhibition of progesterone receptor mediated progesterone-induced alkaline phosphatase activity in human T47D cells
In DepthDetails ArticlePubMed