BDBM50270629 7-(3-Chloro-4-fluorophenyl)-5-ethyl-5-(2-furyl)-1,5-dihydro-4,1-benzoxazepin-2(H)-one::CHEMBL520223
SMILES CCC1(OCC(=O)Nc2ccc(cc12)-c1ccc(F)c(Cl)c1)c1ccco1
InChI Key InChIKey=XJVCASQPSUGYHU-UHFFFAOYSA-N
Data  1 IC50
  Tab Delimited (TSV)   2D SDfile   Computed 3D by Vconf -m prep SDfile
Find this compound or compounds like it in BindingDB:
Activity Spreadsheet -- Enzyme Inhibition Constant Data from BindingDB
Found 1 hit for monomerid = 50270629
TargetProgesterone receptor(Homo sapiens (Human))
Wyeth Research
Curated by ChEMBL
LigandPNGBDBM50270629(7-(3-Chloro-4-fluorophenyl)-5-ethyl-5-(2-furyl)-1,...)
Affinity DataIC50:  62.5nM. Assay description: Inhibition of progesterone receptor mediated progesterone-induced alkaline phosphatase activity in human T47D cells
In DepthDetails ArticlePubMed