BDBM50270633 7-(3-Chloro-4-fluorophenyl)-5-(2-furyl)-5-(pentafluoroethyl)-1,5-dihydro-4,1-benzoxazepin-2(H)-one::CHEMBL488559
SMILES Fc1ccc(cc1Cl)-c1ccc2NC(=O)COC(c3ccco3)(c2c1)C(F)(F)C(F)(F)F
InChI Key InChIKey=HVQVUCLPZYCYGH-UHFFFAOYSA-N
Data  1 IC50
  Tab Delimited (TSV)   2D SDfile   Computed 3D by Vconf -m prep SDfile
Find this compound or compounds like it in BindingDB:
Activity Spreadsheet -- Enzyme Inhibition Constant Data from BindingDB
Found 1 hit for monomerid = 50270633
TargetProgesterone receptor(Homo sapiens (Human))
Wyeth Research
Curated by ChEMBL
LigandPNGBDBM50270633(7-(3-Chloro-4-fluorophenyl)-5-(2-furyl)-5-(pentafl...)
Affinity DataIC50:  82.4nM. Assay description: Inhibition of progesterone receptor mediated progesterone-induced alkaline phosphatase activity in human T47D cells
In DepthDetails ArticlePubMed