BDBM50270734 (4Z)-6-Bromo-4-({[4-(4-methylpiperazin-1-yl)phenyl]amino}-methylene)isoquinoline-1,3(2H,4H)-dione::CHEMBL486286
SMILES CN1CCN(CC1)c1ccc(NC=C2C(=O)NC(=O)c3ccc(Br)cc23)cc1
InChI Key InChIKey=XSWYPCMJALBXBX-UHFFFAOYSA-N
Data  3 IC50
  Tab Delimited (TSV)   2D SDfile   Computed 3D by Vconf -m prep SDfile
Find this compound or compounds like it in BindingDB:
Activity Spreadsheet -- Enzyme Inhibition Constant Data from BindingDB
Found 3 hits for monomerid = 50270734
TargetCyclin-dependent kinase 4(Homo sapiens (Human))
Wyeth Research
Curated by ChEMBL
LigandPNGBDBM50270734((4Z)-6-Bromo-4-({[4-(4-methylpiperazin-1-yl)phenyl...)
Affinity DataIC50:  1.40E+3nM. Assay description: Inhibition of CDK4/cyclin D1 (unknown origin) expressed in Sf9 cells-baculovirus system assessed as retinoblastoma susceptibility gene product phosph...
In DepthDetails ArticlePubMed
TargetCyclin-dependent kinase 2(Homo sapiens (Human))
Wyeth Research
Curated by ChEMBL
LigandPNGBDBM50270734((4Z)-6-Bromo-4-({[4-(4-methylpiperazin-1-yl)phenyl...)
Affinity DataIC50: >5.00E+4nM. Assay description: Inhibition of CDK2/cyclin E (unknown origin) expressed in Sf9 cells-baculovirus system assessed as retinoblastoma susceptibility gene product phospho...
In DepthDetails ArticlePubMed
TargetCyclin-dependent kinase 1(Homo sapiens (Human))
Wyeth Research
Curated by ChEMBL
LigandPNGBDBM50270734((4Z)-6-Bromo-4-({[4-(4-methylpiperazin-1-yl)phenyl...)
Affinity DataIC50: >5.00E+4nM. Assay description: Inhibition of CDK1/Cyclin B1 (unknown origin) expressed in Sf9 cells-baculovirus system assessed as retinoblastoma susceptibility gene product phosph...
In DepthDetails ArticlePubMed