BDBM50271140 9-[(3-{4-[(5,6-Dimethoxy-1-oxoindan-2-yl)methyl]piperidin-1-yl}propyl)amino]-1,2,3,4-tetrahydroacridine dihydrochloride::CHEMBL460370
SMILES COc1cc2CC(CC3CCN(CCCNc4c5CCCCc5nc5ccccc45)CC3)C(=O)c2cc1OC
InChI Key InChIKey=IWFRXMAENNIBJM-UHFFFAOYSA-N
Data  3 IC50
  Tab Delimited (TSV)   2D SDfile   Computed 3D by Vconf -m prep SDfile
Find this compound or compounds like it in BindingDB:
Activity Spreadsheet -- Enzyme Inhibition Constant Data from BindingDB
Found 3 hits for monomerid = 50271140
TargetAcetylcholinesterase(Bos taurus (bovine))
Laboratori De Qu�Mica Farmac�Utica (Unitat Associada Al Csic)
Curated by ChEMBL
LigandPNGBDBM50271140(9-[(3-{4-[(5,6-Dimethoxy-1-oxoindan-2-yl)methyl]pi...)
Affinity DataIC50:  0.290nM. Assay description: Inhibition of bovine erythrocyte AChE by Ellman's assay
In DepthDetails ArticlePubMed
TargetCholinesterase(Homo sapiens (Human))
Laboratori De Qu�Mica Farmac�Utica (Unitat Associada Al Csic)
Curated by ChEMBL
LigandPNGBDBM50271140(9-[(3-{4-[(5,6-Dimethoxy-1-oxoindan-2-yl)methyl]pi...)
Affinity DataIC50:  12.3nM. Assay description: Inhibition of human serum BChE by Ellman's assay
In DepthDetails ArticlePubMed
TargetAcetylcholinesterase(Homo sapiens (Human))
Laboratori De Qu�Mica Farmac�Utica (Unitat Associada Al Csic)
Curated by ChEMBL
LigandPNGBDBM50271140(9-[(3-{4-[(5,6-Dimethoxy-1-oxoindan-2-yl)methyl]pi...)
Affinity DataIC50:  0.880nM. Assay description: Inhibition of human erythrocyte AChE by Ellman's assay
In DepthDetails ArticlePubMed